openmrs-api: There are test failures.

Kind help please! Am running into this error and I have failed to get the way out


[INFO] OpenMRS … SUCCESS [ 4.078 s]

[INFO] openmrs-tools … SUCCESS [ 0.748 s]

[INFO] openmrs-test … SUCCESS [ 0.098 s]

[INFO] openmrs-api … FAILURE [34:56 min]

[INFO] openmrs-web … SKIPPED

[INFO] openmrs-webapp … SKIPPED

[INFO] openmrs-liquibase … SKIPPED

[INFO] ------------------------------------------------------------------------


[INFO] ------------------------------------------------------------------------

[INFO] Total time: 35:02 min

[INFO] Finished at: 2020-07-23T16:46:17Z

[INFO] Final Memory: 66M/230M

[INFO] ------------------------------------------------------------------------

[ERROR] Failed to execute goal org.apache.maven.plugins:maven-surefire-plugin:2.22.2:test (default-test) on project openmrs-api: There are test failures.


[ERROR] Please refer to /home/travis/build/openmrs/openmrs-core/api/target/surefire-reports for the individual test results.

[ERROR] Please refer to dump files (if any exist) [date].dump, [date]-jvmRun[N].dump and [date].dumpstream.

[ERROR] -> [Help 1]by 4 spaces

This link has the entire error log as per the changes made on this draft Pull Request on this link . Some to help unblock me please!